Reaction Details
TargetC-X-C chemokine receptor type 2
LigandBDBM50203022
Substrate/Competitorn/a
Meas. Tech.ChEMBL_454110 (CHEMBL903301)
IC50>9000±n/a nM
Citation McCleland, BWDavis, RSPalovich, MRWiddowson, KLWerner, MLBurman, MFoley, JJSchmidt, DBSarau, HMRogers, MSalyers, KLGorycki, PDRoethke, TJStelman, GJAzzarano, LMWard, KWBusch-Petersen, J Comparison of N,N'-diarylsquaramides and N,N'-diarylureas as antagonists of the CXCR2 chemokine receptor. Bioorg Med Chem Lett17:1713-7 (2007) 
 
C-X-C chemokine receptor type 2
Name:C-X-C chemokine receptor type 2
Type:Protein
Mol. Mass.:40767.88
Organism:Homo sapiens (Human)
Description:P25025
Residue:360
BDBM50203022
NameBDBM50203022
Synonyms:1-(2-bromophenyl)-3-(2-hydroxyphenyl)urea | CHEMBL239560
TypeSmall organic molecule
Emp. Form.C13H11BrN2O2
Mol. Mass.307.143
SMILESOc1ccccc1NC(=O)Nc1ccccc1Br