Reaction Details
TargetC-X-C chemokine receptor type 2
LigandBDBM50203027
Substrate/Competitorn/a
Meas. Tech.ChEMBL_454110 (CHEMBL903301)
IC50 44±n/a nM
Citation McCleland, BWDavis, RSPalovich, MRWiddowson, KLWerner, MLBurman, MFoley, JJSchmidt, DBSarau, HMRogers, MSalyers, KLGorycki, PDRoethke, TJStelman, GJAzzarano, LMWard, KWBusch-Petersen, J Comparison of N,N'-diarylsquaramides and N,N'-diarylureas as antagonists of the CXCR2 chemokine receptor. Bioorg Med Chem Lett17:1713-7 (2007) 
 
C-X-C chemokine receptor type 2
Name:C-X-C chemokine receptor type 2
Type:Protein
Mol. Mass.:40767.88
Organism:Homo sapiens (Human)
Description:P25025
Residue:360
BDBM50203027
NameBDBM50203027
Synonyms:3-[2-hydroxy-3-(4-methyl-[1,4]diazepane-1-carbonyl)-phenylamino]-4-phenylamino-cyclobut-3-ene-1,2-dione trifluoro-acetic acid salt | CHEMBL240458
TypeSmall organic molecule
Emp. Form.C23H24N4O4
Mol. Mass.420.4611
SMILESCN1CCCN(CC1)C(=O)c1cccc(Nc2c(Nc3ccccc3)c(=O)c2=O)c1O