Reaction Details
TargetC-X-C chemokine receptor type 2
LigandBDBM50203030
Substrate/Competitorn/a
Meas. Tech.ChEMBL_454110 (CHEMBL903301)
IC50 8±n/a nM
Citation McCleland, BWDavis, RSPalovich, MRWiddowson, KLWerner, MLBurman, MFoley, JJSchmidt, DBSarau, HMRogers, MSalyers, KLGorycki, PDRoethke, TJStelman, GJAzzarano, LMWard, KWBusch-Petersen, J Comparison of N,N'-diarylsquaramides and N,N'-diarylureas as antagonists of the CXCR2 chemokine receptor. Bioorg Med Chem Lett17:1713-7 (2007) 
 
C-X-C chemokine receptor type 2
Name:C-X-C chemokine receptor type 2
Type:Protein
Mol. Mass.:40767.88
Organism:Homo sapiens (Human)
Description:P25025
Residue:360
BDBM50203030
NameBDBM50203030
Synonyms:3-[4-chloro-3-(4-ethyl-piperazine-1-sulfonyl)-2-hydroxy-phenylamino]-4-(2-propyl-phenylamino)-cyclobut-3-ene-1,2-dione trifluoro-acetic acid salt | CHEMBL238971
TypeSmall organic molecule
Emp. Form.C25H29ClN4O5S
Mol. Mass.533.04
SMILESCCCc1ccccc1Nc1c(Nc2ccc(Cl)c(c2O)S(=O)(=O)N2CCN(CC)CC2)c(=O)c1=O