Reaction Details
TargetGlucocorticoid receptor
LigandBDBM50203580
Substrate/Competitorn/a
Meas. Tech.ChEMBL_454239 (CHEMBL903422)
Ki 9±n/a nM
Citation Jiang, WFiordeliso, JJAllan, GLinton, OTannenbaum, PXu, JZhu, PGunnet, JDemarest, KLundeen, SSui, Z Discovery of novel phosphorus-containing steroids as selective glucocorticoid receptor antagonist. Bioorg Med Chem Lett17:1471-4 (2007) 
 
Glucocorticoid receptor
Name:Glucocorticoid receptor
Type:Enzyme
Mol. Mass.:85656.87
Organism:Homo sapiens (Human)
Description:P04150
Residue:777
BDBM50203580
NameBDBM50203580
Synonyms:CHEMBL250751 | diethyl 4-((8S,11R,13S,14S,17S)-17-hydroxy-13-methyl-3-oxo-17-(prop-1-ynyl)-2,3,6,7,8,11,12,13,14,15,16,17-dodecahydro-1H-cyclopenta[a]phenanthren-11-yl)phenylphosphonate
TypeSmall organic molecule
Emp. Form.C31H39O5P
Mol. Mass.522.6121
SMILESCCOP(=O)(OCC)c1ccc(cc1)[C@H]1C[C@@]2(C)[C@@H](CC[C@@]2(O)C#CC)[C@@H]2CCC3=CC(=O)CCC3=C12