Reaction Details
TargetProgesterone receptor
LigandBDBM50203579
Substrate/Competitorn/a
Meas. Tech.ChEMBL_454240 (CHEMBL903423)
IC50 308±n/a nM
Citation Jiang, WFiordeliso, JJAllan, GLinton, OTannenbaum, PXu, JZhu, PGunnet, JDemarest, KLundeen, SSui, Z Discovery of novel phosphorus-containing steroids as selective glucocorticoid receptor antagonist. Bioorg Med Chem Lett17:1471-4 (2007) 
 
Progesterone receptor
Name:Progesterone receptor
Type:Protein
Mol. Mass.:98979.52
Organism:Homo sapiens (Human)
Description:P06401
Residue:933
BDBM50203579
NameBDBM50203579
Synonyms:CHEMBL250750 | diethyl 4-((8S,11R,13S,14S,17R)-17-allyl-17-hydroxy-13-methyl-3-oxo-2,3,6,7,8,11,12,13,14,15,16,17-dodecahydro-1H-cyclopenta[a]phenanthren-11-yl)phenylphosphonate
TypeSmall organic molecule
Emp. Form.C31H41O5P
Mol. Mass.524.628
SMILESCCOP(=O)(OCC)c1ccc(cc1)[C@H]1C[C@@]2(C)[C@@H](CC[C@@]2(O)CC=C)[C@@H]2CCC3=CC(=O)CCC3=C12