Reaction Details
TargetProgesterone receptor
LigandBDBM50203581
Substrate/Competitorn/a
Meas. Tech.ChEMBL_454240 (CHEMBL903423)
IC50>1000±n/a nM
Citation Jiang, WFiordeliso, JJAllan, GLinton, OTannenbaum, PXu, JZhu, PGunnet, JDemarest, KLundeen, SSui, Z Discovery of novel phosphorus-containing steroids as selective glucocorticoid receptor antagonist. Bioorg Med Chem Lett17:1471-4 (2007) 
 
Progesterone receptor
Name:Progesterone receptor
Type:Protein
Mol. Mass.:98979.52
Organism:Homo sapiens (Human)
Description:P06401
Residue:933
BDBM50203581
NameBDBM50203581
Synonyms:CHEMBL401477 | methyl({4-[(2R,10'S,11'S,15'S,17'R)-15'-methyl-3-methylidene-5'-oxospiro[oxolane-2,14'-tetracyclo[8.7.0.0^{2,7}.0^{11,15}]heptadecane]-1',6'-dien-17'-yl]phenyl})phosphinic acid
TypeSmall organic molecule
Emp. Form.C29H35O4P
Mol. Mass.478.5596
SMILESC[C@]12C[C@@H](C3=C4CCC(=O)C=C4CC[C@H]3[C@@H]1CC[C@]21OCCC1=C)c1ccc(cc1)P(C)(O)=O