Reaction Details
TargetGlucocorticoid receptor
LigandBDBM50203582
Substrate/Competitorn/a
Meas. Tech.ChEMBL_454239 (CHEMBL903422)
Ki 3±n/a nM
Citation Jiang, WFiordeliso, JJAllan, GLinton, OTannenbaum, PXu, JZhu, PGunnet, JDemarest, KLundeen, SSui, Z Discovery of novel phosphorus-containing steroids as selective glucocorticoid receptor antagonist. Bioorg Med Chem Lett17:1471-4 (2007) 
 
Glucocorticoid receptor
Name:Glucocorticoid receptor
Type:Enzyme
Mol. Mass.:85656.87
Organism:Homo sapiens (Human)
Description:P04150
Residue:777
BDBM50203582
NameBDBM50203582
Synonyms:(8S,11R,13S,14S,17S)-11-(4-(diphenylphosphoryl)phenyl)-17-hydroxy-13-methyl-17-(prop-1-ynyl)-1,2,7,8,11,12,13,15,16,17-decahydro-6H-cyclopenta[a]phenanthren-3(14H)-one | CHEMBL251303
TypeSmall organic molecule
Emp. Form.C39H39O3P
Mol. Mass.586.6989
SMILESCC#C[C@]1(O)CC[C@H]2[C@@H]3CCC4=CC(=O)CCC4=C3[C@H](C[C@]12C)c1ccc(cc1)P(=O)(c1ccccc1)c1ccccc1