Reaction Details
TargetGlucocorticoid receptor
LigandBDBM50203584
Substrate/Competitorn/a
Meas. Tech.ChEMBL_454239 (CHEMBL903422)
Ki 20±n/a nM
Citation Jiang, WFiordeliso, JJAllan, GLinton, OTannenbaum, PXu, JZhu, PGunnet, JDemarest, KLundeen, SSui, Z Discovery of novel phosphorus-containing steroids as selective glucocorticoid receptor antagonist. Bioorg Med Chem Lett17:1471-4 (2007) 
 
Glucocorticoid receptor
Name:Glucocorticoid receptor
Type:Enzyme
Mol. Mass.:85656.87
Organism:Homo sapiens (Human)
Description:P04150
Residue:777
BDBM50203584
NameBDBM50203584
Synonyms:(8S,11R,13S,14S,17S)-11-(4-(diphenylphosphoryl)phenyl)-17-hydroxy-13-methyl-17-phenyl-1,2,7,8,11,12,13,15,16,17-decahydro-6H-cyclopenta[a]phenanthren-3(14H)-one | CHEMBL400791
TypeSmall organic molecule
Emp. Form.C42H41O3P
Mol. Mass.624.7469
SMILESC[C@]12C[C@@H](C3=C4CCC(=O)C=C4CC[C@H]3[C@@H]1CC[C@@]2(O)c1ccccc1)c1ccc(cc1)P(=O)(c1ccccc1)c1ccccc1