Reaction Details
TargetGlucocorticoid receptor
LigandBDBM50203578
Substrate/Competitorn/a
Meas. Tech.ChEMBL_454239 (CHEMBL903422)
Ki 59.8±n/a nM
Citation Jiang, WFiordeliso, JJAllan, GLinton, OTannenbaum, PXu, JZhu, PGunnet, JDemarest, KLundeen, SSui, Z Discovery of novel phosphorus-containing steroids as selective glucocorticoid receptor antagonist. Bioorg Med Chem Lett17:1471-4 (2007) 
 
Glucocorticoid receptor
Name:Glucocorticoid receptor
Type:Enzyme
Mol. Mass.:85656.87
Organism:Homo sapiens (Human)
Description:P04150
Residue:777
BDBM50203578
NameBDBM50203578
Synonyms:CHEMBL413806 | ethyl methyl({4-[(2R,10'S,11'S,15'S,17'R)-15'-methyl-3-methylidene-5'-oxospiro[oxolane-2,14'-tetracyclo[8.7.0.0^{2,7}.0^{11,15}]heptadecane]-1',6'-dien-17'-yl]phenyl})phosphinate
TypeSmall organic molecule
Emp. Form.C31H39O4P
Mol. Mass.506.6127
SMILESCCOP(C)(=O)c1ccc(cc1)[C@H]1C[C@@]2(C)[C@@H](CC[C@]22OCCC2=C)[C@@H]2CCC3=CC(=O)CCC3=C12