Reaction Details
TargetProgesterone receptor
LigandBDBM50203586
Substrate/Competitorn/a
Meas. Tech.ChEMBL_454240 (CHEMBL903423)
IC50 9.9±n/a nM
Citation Jiang, WFiordeliso, JJAllan, GLinton, OTannenbaum, PXu, JZhu, PGunnet, JDemarest, KLundeen, SSui, Z Discovery of novel phosphorus-containing steroids as selective glucocorticoid receptor antagonist. Bioorg Med Chem Lett17:1471-4 (2007) 
 
Progesterone receptor
Name:Progesterone receptor
Type:Protein
Mol. Mass.:98979.52
Organism:Homo sapiens (Human)
Description:P06401
Residue:933
BDBM50203586
NameBDBM50203586
Synonyms:CHEMBL400047 | diethyl {4-[(2R,10'S,11'S,15'S,17'R)-15'-methyl-3-methylidene-5'-oxospiro[oxolane-2,14'-tetracyclo[8.7.0.0^{2,7}.0^{11,15}]heptadecane]-1',6'-dien-17'-yl]phenyl}phosphonate
TypeSmall organic molecule
Emp. Form.C32H41O5P
Mol. Mass.536.6387
SMILESCCOP(=O)(OCC)c1ccc(cc1)[C@H]1C[C@@]2(C)[C@@H](CC[C@]22OCCC2=C)[C@@H]2CCC3=CC(=O)CCC3=C12