Reaction Details
TargetProgesterone receptor
LigandBDBM18627
Substrate/Competitorn/a
Meas. Tech.ChEMBL_454240 (CHEMBL903423)
IC50 2.6±n/a nM
Citation Jiang, WFiordeliso, JJAllan, GLinton, OTannenbaum, PXu, JZhu, PGunnet, JDemarest, KLundeen, SSui, Z Discovery of novel phosphorus-containing steroids as selective glucocorticoid receptor antagonist. Bioorg Med Chem Lett17:1471-4 (2007) 
 
Progesterone receptor
Name:Progesterone receptor
Type:Protein
Mol. Mass.:98979.52
Organism:Homo sapiens (Human)
Description:P06401
Residue:933
BDBM18627
NameBDBM18627
Synonyms:(10S,11S,14S,15S,17R)-17-[4-(dimethylamino)phenyl]-14-hydroxy-15-methyl-14-(prop-1-yn-1-yl)tetracyclo[8.7.0.0^{2,7}.0^{11,15}]heptadeca-1,6-dien-5-one Mifepristone RU486 (tetramethyl-rhodamine conjugated)
TypeSmall organic molecule
Emp. Form.C29H35NO2
Mol. Mass.429.5937
SMILES[H][C@@]12CC[C@@](O)(C#CC)[C@@]1(C)C[C@@H](C1=C3CCC(=O)C=C3CC[C@@]21[H])c1ccc(cc1)N(C)C