Reaction Details
TargetAcetylcholinesterase
LigandBDBM50211239
Substrate/Competitorn/a
Meas. Tech.ChEMBL_455571 (CHEMBL886351)
IC50 1.06±n/a nM
Citation Tang, HNing, FXWei, YBHuang, SLHuang, ZSChan, ASGu, LQ Derivatives of oxoisoaporphine alkaloids: a novel class of selective acetylcholinesterase inhibitors. Bioorg Med Chem Lett17:3765-8 (2007) 
 
Acetylcholinesterase
Name:Acetylcholinesterase
Type:Enzyme
Mol. Mass.:71812.79
Organism:Electrophorus electricus (Electric eel)
Description:n/a
Residue:633
BDBM50211239
NameBDBM50211239
Synonyms:1-methyl-1-[2-(7-oxo-7H-1-aza-benzo[de]anthracen-9-ylcarbamoyl)-ethyl]-pyrrolidinium | CHEMBL245470
TypeSmall organic molecule
Emp. Form.C24H24N3O2
Mol. Mass.386.4657
SMILESC[N+]1(CCC(=O)Nc2ccc-3c(c2)C(=O)c2cccc4ccnc-3c24)CCCC1