Reaction Details
TargetAcetylcholinesterase
LigandBDBM50211242
Substrate/Competitorn/a
Meas. Tech.ChEMBL_455571 (CHEMBL886351)
IC50 30.51±n/a nM
Citation Tang, HNing, FXWei, YBHuang, SLHuang, ZSChan, ASGu, LQ Derivatives of oxoisoaporphine alkaloids: a novel class of selective acetylcholinesterase inhibitors. Bioorg Med Chem Lett17:3765-8 (2007) 
 
Acetylcholinesterase
Name:Acetylcholinesterase
Type:Enzyme
Mol. Mass.:71812.79
Organism:Electrophorus electricus (Electric eel)
Description:n/a
Residue:633
BDBM50211242
NameBDBM50211242
Synonyms:4-dimethylamino-N-(7-oxo-7H-1-aza-benzo[de]anthracen-9-yl)-butyramide CHEMBL245472
TypeSmall organic molecule
Emp. Form.C22H21N3O2
Mol. Mass.359.421
SMILESCN(C)CCCC(=O)Nc1ccc-2c(c1)C(=O)c1cccc3ccnc-2c13