Reaction Details
TargetAcetylcholinesterase
LigandBDBM50211245
Substrate/Competitorn/a
Meas. Tech.ChEMBL_455571 (CHEMBL886351)
IC50 55.1±n/a nM
Citation Tang, HNing, FXWei, YBHuang, SLHuang, ZSChan, ASGu, LQ Derivatives of oxoisoaporphine alkaloids: a novel class of selective acetylcholinesterase inhibitors. Bioorg Med Chem Lett17:3765-8 (2007) 
 
Acetylcholinesterase
Name:Acetylcholinesterase
Type:Enzyme
Mol. Mass.:71812.79
Organism:Electrophorus electricus (Electric eel)
Description:n/a
Residue:633
BDBM50211245
NameBDBM50211245
Synonyms:3-(2-hydroxy-ethylamino)-N-(7-oxo-7H-1-aza-benzo[de]anthracen-9-yl)-propionamide CHEMBL245670
TypeSmall organic molecule
Emp. Form.C21H19N3O3
Mol. Mass.361.3939
SMILESOCCNCCC(=O)Nc1ccc-2c(c1)C(=O)c1cccc3ccnc-2c13