Reaction Details
TargetCarboxylic ester hydrolase
LigandBDBM50211243
Substrate/Competitorn/a
Meas. Tech.ChEMBL_455572 (CHEMBL886352)
IC50 1950±n/a nM
Citation Tang, HNing, FXWei, YBHuang, SLHuang, ZSChan, ASGu, LQ Derivatives of oxoisoaporphine alkaloids: a novel class of selective acetylcholinesterase inhibitors. Bioorg Med Chem Lett17:3765-8 (2007) 
 
Carboxylic ester hydrolase
Name:Carboxylic ester hydrolase
Type:Protein
Mol. Mass.:68842.83
Organism:Equus caballus (Horse)
Description:Q9N1N9
Residue:602
BDBM50211243
NameBDBM50211243
Synonyms:3-dimethylamino-N-(7-oxo-7H-1-aza-benzo[de]anthracen-9-yl)-propionamide CHEMBL245471
TypeSmall organic molecule
Emp. Form.C21H19N3O2
Mol. Mass.345.3945
SMILESCN(C)CCC(=O)Nc1ccc-2c(c1)C(=O)c1cccc3ccnc-2c13