Reaction Details
Target3-oxoacyl-[acyl-carrier-protein] synthase 3
LigandBDBM50220625
Substrate/Competitorn/a
Meas. Tech.ChEMBL_457362 (CHEMBL940953)
IC50 15000±n/a nM
Citation Bhowruth, VBrown, AKSenior, SJSnaith, JSBesra, GS Synthesis and biological evaluation of a C5-biphenyl thiolactomycin library. Bioorg Med Chem Lett17:5643-6 (2007) 
 
3-oxoacyl-[acyl-carrier-protein] synthase 3
Name:3-oxoacyl-[acyl-carrier-protein] synthase 3
Type:Enzyme
Mol. Mass.:34865.07
Organism:Mycobacterium tuberculosis
Description:P9WNG3
Residue:335
BDBM50220625
NameBDBM50220625
Synonyms:4-hydroxy-3,5-dimethyl-5-(4-phenoxy-benzyl)-5H-thiophen-2-one | CHEMBL250630
TypeSmall organic molecule
Emp. Form.C19H18O3S
Mol. Mass.326.409
SMILESCC1C(=O)SC(C)(Cc2ccc(Oc3ccccc3)cc2)C1=O