Reaction Details
Target3-oxoacyl-[acyl-carrier-protein] synthase 3
LigandBDBM50220630
Substrate/Competitorn/a
Meas. Tech.ChEMBL_457362 (CHEMBL940953)
IC50 3000±n/a nM
Citation Bhowruth, VBrown, AKSenior, SJSnaith, JSBesra, GS Synthesis and biological evaluation of a C5-biphenyl thiolactomycin library. Bioorg Med Chem Lett17:5643-6 (2007) 
 
3-oxoacyl-[acyl-carrier-protein] synthase 3
Name:3-oxoacyl-[acyl-carrier-protein] synthase 3
Type:Enzyme
Mol. Mass.:34865.07
Organism:Mycobacterium tuberculosis
Description:P9WNG3
Residue:335
BDBM50220630
NameBDBM50220630
Synonyms:5-(4-methoxycarbonyl-biphenyl-4-ylmethyl)-4-hydroxy-3,5-dimethyl-5H-thiophen-2-one | CHEMBL250431
TypeSmall organic molecule
Emp. Form.C21H20O4S
Mol. Mass.368.446
SMILESCOC(=O)c1ccc(cc1)-c1ccc(CC2(C)SC(=O)C(C)C2=O)cc1