Reaction Details
TargetGlucocorticoid receptor
LigandBDBM50221153
Substrate/Competitorn/a
Meas. Tech.ChEMBL_457478 (CHEMBL941996)
Ki 4±n/a nM
Citation Clark, RDRay, NCBlaney, PCrackett, PHHurley, CWilliams, KDyke, HJClark, DELockey, PMDevos, RWong, MWhite, ABelanoff, JK 2-Benzenesulfonyl-8a-benzyl-hexahydro-2H-isoquinolin-6-ones as selective glucocorticoid receptor antagonists. Bioorg Med Chem Lett17:5704-8 (2007) 
 
Glucocorticoid receptor
Name:Glucocorticoid receptor
Type:Enzyme
Mol. Mass.:85656.87
Organism:Homo sapiens (Human)
Description:P04150
Residue:777
BDBM50221153
NameBDBM50221153
Synonyms:(R)-8a-(4-methoxybenzyl)-2-(4-tert-butylphenylsulfonyl)-1,2,3,4,8,8a-hexahydroisoquinolin-6(7H)-one | CHEMBL250700
TypeSmall organic molecule
Emp. Form.C27H33NO4S
Mol. Mass.467.62
SMILESCOc1ccc(C[C@]23CCC(=O)C=C2CCN(C3)S(=O)(=O)c2ccc(cc2)C(C)(C)C)cc1