Reaction Details
TargetGlucocorticoid receptor
LigandBDBM50113780
Substrate/Competitorn/a
Meas. Tech.ChEMBL_457478 (CHEMBL941996)
Ki 0.6±n/a nM
Citation Clark, RDRay, NCBlaney, PCrackett, PHHurley, CWilliams, KDyke, HJClark, DELockey, PMDevos, RWong, MWhite, ABelanoff, JK 2-Benzenesulfonyl-8a-benzyl-hexahydro-2H-isoquinolin-6-ones as selective glucocorticoid receptor antagonists. Bioorg Med Chem Lett17:5704-8 (2007) 
 
Glucocorticoid receptor
Name:Glucocorticoid receptor
Type:Enzyme
Mol. Mass.:85656.87
Organism:Homo sapiens (Human)
Description:P04150
Residue:777
BDBM50113780
NameBDBM50113780
Synonyms:(2R,4aS,10aR)-4a-benzyl-2-(prop-1-ynyl)-1,2,3,4,4a,9,10,10a-octahydrophenanthrene-2,7-diol CHEMBL78625 | CP-409069
TypeSmall organic molecule
Emp. Form.C24H26O2
Mol. Mass.346.462
SMILESCC#C[C@@]1(O)CC[C@]2(Cc3ccccc3)[C@H](CCc3cc(O)ccc23)C1