Reaction Details
TargetGlucocorticoid receptor
LigandBDBM50221172
Substrate/Competitorn/a
Meas. Tech.ChEMBL_457478 (CHEMBL941996)
Ki 113±n/a nM
Citation Clark, RDRay, NCBlaney, PCrackett, PHHurley, CWilliams, KDyke, HJClark, DELockey, PMDevos, RWong, MWhite, ABelanoff, JK 2-Benzenesulfonyl-8a-benzyl-hexahydro-2H-isoquinolin-6-ones as selective glucocorticoid receptor antagonists. Bioorg Med Chem Lett17:5704-8 (2007) 
 
Glucocorticoid receptor
Name:Glucocorticoid receptor
Type:Enzyme
Mol. Mass.:85656.87
Organism:Homo sapiens (Human)
Description:P04150
Residue:777
BDBM50221172
NameBDBM50221172
Synonyms:8a-benzyl-2-(4-(dimethylamino)phenylsulfonyl)-1,2,3,4,8,8a-hexahydroisoquinolin-6(7H)-one | CHEMBL247603
TypeSmall organic molecule
Emp. Form.C24H28N2O3S
Mol. Mass.424.556
SMILESCN(C)c1ccc(cc1)S(=O)(=O)N1CCC2=CC(=O)CCC2(Cc2ccccc2)C1