Reaction Details
TargetGlucocorticoid receptor
LigandBDBM50221179
Substrate/Competitorn/a
Meas. Tech.ChEMBL_457479 (CHEMBL941997)
Ki>1000±n/a nM
Citation Clark, RDRay, NCBlaney, PCrackett, PHHurley, CWilliams, KDyke, HJClark, DELockey, PMDevos, RWong, MWhite, ABelanoff, JK 2-Benzenesulfonyl-8a-benzyl-hexahydro-2H-isoquinolin-6-ones as selective glucocorticoid receptor antagonists. Bioorg Med Chem Lett17:5704-8 (2007) 
 
Glucocorticoid receptor
Name:Glucocorticoid receptor
Type:Enzyme
Mol. Mass.:85656.87
Organism:Homo sapiens (Human)
Description:P04150
Residue:777
BDBM50221179
NameBDBM50221179
Synonyms:CHEMBL398668 | N-(4-((2-(4-tert-butylphenylsulfonyl)-6-oxo-1,2,3,4,6,7,8,8a-octahydroisoquinolin-8a-yl)methyl)phenyl)acetamide
TypeSmall organic molecule
Emp. Form.C28H34N2O4S
Mol. Mass.494.646
SMILESCC(=O)Nc1ccc(CC23CCC(=O)C=C2CCN(C3)S(=O)(=O)c2ccc(cc2)C(C)(C)C)cc1