Reaction Details
TargetGlucocorticoid receptor
LigandBDBM50221189
Substrate/Competitorn/a
Meas. Tech.ChEMBL_457478 (CHEMBL941996)
Ki 1000±n/a nM
Citation Clark, RDRay, NCBlaney, PCrackett, PHHurley, CWilliams, KDyke, HJClark, DELockey, PMDevos, RWong, MWhite, ABelanoff, JK 2-Benzenesulfonyl-8a-benzyl-hexahydro-2H-isoquinolin-6-ones as selective glucocorticoid receptor antagonists. Bioorg Med Chem Lett17:5704-8 (2007) 
 
Glucocorticoid receptor
Name:Glucocorticoid receptor
Type:Enzyme
Mol. Mass.:85656.87
Organism:Homo sapiens (Human)
Description:P04150
Residue:777
BDBM50221189
NameBDBM50221189
Synonyms:2-(8a-benzyl-6-oxo-3,4,6,7,8,8a-hexahydroisoquinolin-2(1H)-ylsulfonyl)benzonitrile | CHEMBL391182
TypeSmall organic molecule
Emp. Form.C23H22N2O3S
Mol. Mass.406.497
SMILESO=C1CCC2(Cc3ccccc3)CN(CCC2=C1)S(=O)(=O)c1ccccc1C#N