Reaction Details
TargetGlucocorticoid receptor
LigandBDBM50221195
Substrate/Competitorn/a
Meas. Tech.ChEMBL_457478 (CHEMBL941996)
Ki 55±n/a nM
Citation Clark, RDRay, NCBlaney, PCrackett, PHHurley, CWilliams, KDyke, HJClark, DELockey, PMDevos, RWong, MWhite, ABelanoff, JK 2-Benzenesulfonyl-8a-benzyl-hexahydro-2H-isoquinolin-6-ones as selective glucocorticoid receptor antagonists. Bioorg Med Chem Lett17:5704-8 (2007) 
 
Glucocorticoid receptor
Name:Glucocorticoid receptor
Type:Enzyme
Mol. Mass.:85656.87
Organism:Homo sapiens (Human)
Description:P04150
Residue:777
BDBM50221195
NameBDBM50221195
Synonyms:8a-benzyl-2-(biphenyl-4-sulfonyl)-1,3,4,7,8,8a-hexahydro-2H-isoquinolin-6-one | CHEMBL247235
TypeSmall organic molecule
Emp. Form.C28H27NO3S
Mol. Mass.457.584
SMILESO=C1CCC2(Cc3ccccc3)CN(CCC2=C1)S(=O)(=O)c1ccc(cc1)-c1ccccc1