Reaction Details
TargetGlucocorticoid receptor
LigandBDBM50221177
Substrate/Competitorn/a
Meas. Tech.ChEMBL_457478 (CHEMBL941996)
Ki 15±n/a nM
Citation Clark, RDRay, NCBlaney, PCrackett, PHHurley, CWilliams, KDyke, HJClark, DELockey, PMDevos, RWong, MWhite, ABelanoff, JK 2-Benzenesulfonyl-8a-benzyl-hexahydro-2H-isoquinolin-6-ones as selective glucocorticoid receptor antagonists. Bioorg Med Chem Lett17:5704-8 (2007) 
 
Glucocorticoid receptor
Name:Glucocorticoid receptor
Type:Enzyme
Mol. Mass.:85656.87
Organism:Homo sapiens (Human)
Description:P04150
Residue:777
BDBM50221177
NameBDBM50221177
Synonyms:8a-(4-(dimethylamino)benzyl)-2-(4-tert-butylphenylsulfonyl)-1,2,3,4,8,8a-hexahydroisoquinolin-6(7H)-one | CHEMBL247638
TypeSmall organic molecule
Emp. Form.C28H36N2O3S
Mol. Mass.480.662
SMILESCN(C)c1ccc(CC23CCC(=O)C=C2CCN(C3)S(=O)(=O)c2ccc(cc2)C(C)(C)C)cc1