Reaction Details
TargetCannabinoid receptor 1
LigandBDBM50225147
Substrate/Competitorn/a
Meas. Tech.ChEMBL_458569 (CHEMBL941882)
Ki 560±n/a nM
Citation Manera, CCascio, MGBenetti, VAllarà, MTuccinardi, TMartinelli, ASaccomanni, GVivoli, EGhelardini, CDi Marzo, VFerrarini, PL New 1,8-naphthyridine and quinoline derivatives as CB2 selective agonists. Bioorg Med Chem Lett17:6505-10 (2007) 
 
Cannabinoid receptor 1
Name:Cannabinoid receptor 1
Type:G Protein-Coupled Receptor (GPCR)
Mol. Mass.:52868.96
Organism:Homo sapiens (Human)
Description:P21554
Residue:472
BDBM50225147
NameBDBM50225147
Synonyms:1-benzyl-N-cyclohexyl-7-methoxy-4-oxo-1,4-dihydro-1,8-naphthyridine-3-carboxamide | CHEMBL250565
TypeSmall organic molecule
Emp. Form.C23H25N3O3
Mol. Mass.391.4629
SMILESCOc1ccc2c(n1)n(Cc1ccccc1)cc(C(=O)NC1CCCCC1)c2=O