Reaction Details
TargetCannabinoid receptor 1
LigandBDBM50225152
Substrate/Competitorn/a
Meas. Tech.ChEMBL_458569 (CHEMBL941882)
Ki 17±n/a nM
Citation Manera, CCascio, MGBenetti, VAllarà, MTuccinardi, TMartinelli, ASaccomanni, GVivoli, EGhelardini, CDi Marzo, VFerrarini, PL New 1,8-naphthyridine and quinoline derivatives as CB2 selective agonists. Bioorg Med Chem Lett17:6505-10 (2007) 
 
Cannabinoid receptor 1
Name:Cannabinoid receptor 1
Type:G Protein-Coupled Receptor (GPCR)
Mol. Mass.:52868.96
Organism:Homo sapiens (Human)
Description:P21554
Residue:472
BDBM50225152
NameBDBM50225152
Synonyms:1-benzyl-N-cycloheptyl-4-oxo-1,4-dihydroquinoline-3-carboxamide | CHEMBL250768
TypeSmall organic molecule
Emp. Form.C24H26N2O2
Mol. Mass.374.4754
SMILESO=C(NC1CCCCCC1)c1cn(Cc2ccccc2)c2ccccc2c1=O