Reaction Details
TargetCannabinoid receptor 2
LigandBDBM50225149
Substrate/Competitorn/a
Meas. Tech.ChEMBL_458570 (CHEMBL941883)
Ki 1640±n/a nM
Citation Manera, CCascio, MGBenetti, VAllarà, MTuccinardi, TMartinelli, ASaccomanni, GVivoli, EGhelardini, CDi Marzo, VFerrarini, PL New 1,8-naphthyridine and quinoline derivatives as CB2 selective agonists. Bioorg Med Chem Lett17:6505-10 (2007) 
 
Cannabinoid receptor 2
Name:Cannabinoid receptor 2
Type:G Protein-Coupled Receptor (GPCR)
Mol. Mass.:39690.94
Organism:Homo sapiens (Human)
Description:P34972
Residue:360
BDBM50225149
NameBDBM50225149
Synonyms:5-benzyl-7-chloro-2-cyclohexyl-2H-pyrazolo[4,3-c]quinolin-3(5H)-one | CHEMBL250966
TypeSmall organic molecule
Emp. Form.C23H22ClN3O
Mol. Mass.391.893
SMILESClc1ccc2c3nn(C4CCCCC4)c(=O)c3cn(Cc3ccccc3)c2c1