Reaction Details
TargetCannabinoid receptor 2
LigandBDBM50225155
Substrate/Competitorn/a
Meas. Tech.ChEMBL_458570 (CHEMBL941883)
Ki 2280±n/a nM
Citation Manera, CCascio, MGBenetti, VAllarà, MTuccinardi, TMartinelli, ASaccomanni, GVivoli, EGhelardini, CDi Marzo, VFerrarini, PL New 1,8-naphthyridine and quinoline derivatives as CB2 selective agonists. Bioorg Med Chem Lett17:6505-10 (2007) 
 
Cannabinoid receptor 2
Name:Cannabinoid receptor 2
Type:G Protein-Coupled Receptor (GPCR)
Mol. Mass.:39690.94
Organism:Homo sapiens (Human)
Description:P34972
Residue:360
BDBM50225155
NameBDBM50225155
Synonyms:5-(2-morpholinoethyl)-2-phenyl-2H-pyrazolo[4,3-c]quinolin-3(5H)-one | CHEMBL251163
TypeSmall organic molecule
Emp. Form.C22H22N4O2
Mol. Mass.374.4357
SMILESO=c1n(nc2c1cn(CCN1CCOCC1)c1ccccc21)-c1ccccc1