Reaction Details
TargetMelanocyte-stimulating hormone receptor
LigandBDBM50027084
Substrate/Competitorn/a
Meas. Tech.ChEMBL_460495 (CHEMBL926575)
IC50 0.200000±n/a nM
Citation Mayorov, AVCai, MPalmer, ESDedek, MMCain, JPVan Scoy, ARTan, BVagner, JTrivedi, DHruby, VJ Structure-activity relationships of cyclic lactam analogues of alpha-melanocyte-stimulating hormone (alpha-MSH) targeting the human melanocortin-3 receptor. J Med Chem51:187-95 (2008) 
 
Melanocyte-stimulating hormone receptor
Name:Melanocyte-stimulating hormone receptor
Type:Enzyme
Mol. Mass.:34717.23
Organism:Homo sapiens (Human)
Description:Q01726
Residue:317
BDBM50027084
NameBDBM50027084
Synonyms:Melatonan
TypeSmall organic molecule
Emp. Form.C50H69N15O9
Mol. Mass.1024.178
SMILESCCCC[C@H](NC(C)=O)C(=O)N[C@H]1CC(=O)NCCCC[C@H](NC(=O)[C@H](Cc2c[nH]c3ccccc23)NC(=O)[C@H](CCCNC(N)=N)NC(=O)[C@@H](Cc2ccccc2)NC(=O)[C@H](Cc2cnc[nH]2)NC1=O)C(N)=O