Reaction Details
TargetMelanocortin receptor 3
LigandBDBM50230818
Substrate/Competitorn/a
Meas. Tech.ChEMBL_460496 (CHEMBL926576)
IC50>10000±n/a nM
Citation Mayorov, AVCai, MPalmer, ESDedek, MMCain, JPVan Scoy, ARTan, BVagner, JTrivedi, DHruby, VJ Structure-activity relationships of cyclic lactam analogues of alpha-melanocyte-stimulating hormone (alpha-MSH) targeting the human melanocortin-3 receptor. J Med Chem51:187-95 (2008) 
 
Melanocortin receptor 3
Name:Melanocortin receptor 3
Type:Enzyme
Mol. Mass.:36044.86
Organism:Homo sapiens (Human)
Description:P41968
Residue:323
BDBM50230818
NameBDBM50230818
Synonyms:CHEMBL413043 | c[CO-2,6-pyridine-CO-D-Phe-Arg-Trp-Lys]-NH2
TypeSmall organic molecule
Emp. Form.C39H47N11O6
Mol. Mass.765.8606
SMILESNC(N)=NCCC[C@@H]1NC(=O)[C@@H](Cc2ccccc2)NC(=O)c2cccc(n2)C(=O)NCCCC[C@H](NC(=O)[C@H](Cc2c[nH]c3ccccc23)NC1=O)C(N)=O