Reaction Details
TargetMelanocyte-stimulating hormone receptor
LigandBDBM50230820
Substrate/Competitorn/a
Meas. Tech.ChEMBL_460495 (CHEMBL926575)
IC50 707±n/a nM
Citation Mayorov, AVCai, MPalmer, ESDedek, MMCain, JPVan Scoy, ARTan, BVagner, JTrivedi, DHruby, VJ Structure-activity relationships of cyclic lactam analogues of alpha-melanocyte-stimulating hormone (alpha-MSH) targeting the human melanocortin-3 receptor. J Med Chem51:187-95 (2008) 
 
Melanocyte-stimulating hormone receptor
Name:Melanocyte-stimulating hormone receptor
Type:Enzyme
Mol. Mass.:34717.23
Organism:Homo sapiens (Human)
Description:Q01726
Residue:317
BDBM50230820
NameBDBM50230820
Synonyms:CHEMBL253789 | c[CO-2,3-pyrazine-CO-D-Nal(2)-Arg-Trp-Lys]-NH2
TypeSmall organic molecule
Emp. Form.C42H48N12O6
Mol. Mass.816.9073
SMILESNC(N)=NCCC[C@@H]1NC(=O)[C@@H](Cc2ccc3ccccc3c2)NC(=O)c2nccnc2C(=O)NCCCC[C@H](NC(=O)[C@H](Cc2c[nH]c3ccccc23)NC1=O)C(N)=O