Reaction Details
TargetMelanocyte-stimulating hormone receptor
LigandBDBM50230816
Substrate/Competitorn/a
Meas. Tech.ChEMBL_460495 (CHEMBL926575)
IC50 2000±n/a nM
Citation Mayorov, AVCai, MPalmer, ESDedek, MMCain, JPVan Scoy, ARTan, BVagner, JTrivedi, DHruby, VJ Structure-activity relationships of cyclic lactam analogues of alpha-melanocyte-stimulating hormone (alpha-MSH) targeting the human melanocortin-3 receptor. J Med Chem51:187-95 (2008) 
 
Melanocyte-stimulating hormone receptor
Name:Melanocyte-stimulating hormone receptor
Type:Enzyme
Mol. Mass.:34717.23
Organism:Homo sapiens (Human)
Description:Q01726
Residue:317
BDBM50230816
NameBDBM50230816
Synonyms:CHEMBL267265 | c[CO-(CH2)2-CO-Nle-D-Nal(2)-Arg-Trp-Lys]-NH2
TypeSmall organic molecule
Emp. Form.C46H61N11O7
Mol. Mass.880.046
SMILESN[C@H]1CCCCC(=O)CCC(=O)NCCCC[C@H](NC(=O)[C@H](Cc2c[nH]c3ccccc23)NC(=O)[C@H](CCCN=C(N)N)NC(=O)[C@@H](Cc2ccc3ccccc3c2)NC1=O)C(N)=O