Reaction Details
TargetMelanocortin receptor 5
LigandBDBM50230813
Substrate/Competitorn/a
Meas. Tech.ChEMBL_460505 (CHEMBL926585)
IC50 120±n/a nM
Citation Mayorov, AVCai, MPalmer, ESDedek, MMCain, JPVan Scoy, ARTan, BVagner, JTrivedi, DHruby, VJ Structure-activity relationships of cyclic lactam analogues of alpha-melanocyte-stimulating hormone (alpha-MSH) targeting the human melanocortin-3 receptor. J Med Chem51:187-95 (2008) 
 
Melanocortin receptor 5
Name:Melanocortin receptor 5
Type:Enzyme
Mol. Mass.:36612.92
Organism:Homo sapiens (Human)
Description:P33032
Residue:325
BDBM50230813
NameBDBM50230813
Synonyms:(3R,6S,9S,12S,25aS)-6-(3-carbamimidamidopropyl)-9-(1H-indol-3-ylmethyl)-3-(naphthalen-2-ylmethyl)-1,4,7,10,18,21-hexaoxo-1H,2H,3H,4H,5H,6H,7H,8H,9H,10H,11H,12H,13H,14H,15H,16H,17H,18H,21H,23H,24H,25H,25aH-pyrrolo[2,1-l]1,4,7,10,13,18-hexaazacyclotricosane-12-carboxamide | CHEMBL398635
TypeSmall organic molecule
Emp. Form.C45H55N11O7
Mol. Mass.861.9877
SMILESNC(=N)NCCC[C@@H]1NC(=O)[C@@H](Cc2ccc3ccccc3c2)NC(=O)[C@@H]2CCCN2C(=O)C=CC(=O)NCCCC[C@H](NC(=O)[C@H](Cc2c[nH]c3ccccc23)NC1=O)C(N)=O