Reaction Details
TargetMelanocortin receptor 5
LigandBDBM50230819
Substrate/Competitorn/a
Meas. Tech.ChEMBL_460505 (CHEMBL926585)
IC50 870±n/a nM
Citation Mayorov, AVCai, MPalmer, ESDedek, MMCain, JPVan Scoy, ARTan, BVagner, JTrivedi, DHruby, VJ Structure-activity relationships of cyclic lactam analogues of alpha-melanocyte-stimulating hormone (alpha-MSH) targeting the human melanocortin-3 receptor. J Med Chem51:187-95 (2008) 
 
Melanocortin receptor 5
Name:Melanocortin receptor 5
Type:Enzyme
Mol. Mass.:36612.92
Organism:Homo sapiens (Human)
Description:P33032
Residue:325
BDBM50230819
NameBDBM50230819
Synonyms:CHEMBL398664 | c[CO-(CH2)3-CO-Pro-D-Phe-Arg-Trp-Lys]-NH2
TypeSmall organic molecule
Emp. Form.C41H57N11O6
Mol. Mass.799.9614
SMILESNC(N)=NCCC[C@@H]1NC(=O)[C@@H](Cc2ccccc2)NC(=O)[C@@H]2CCCN2C(=O)CCCNCCCC[C@H](NC(=O)[C@H](Cc2c[nH]c3ccccc23)NC1=O)C(N)=O