Reaction Details
TargetMelanocortin receptor 5
LigandBDBM50230826
Substrate/Competitorn/a
Meas. Tech.ChEMBL_460505 (CHEMBL926585)
IC50>1000±n/a nM
Citation Mayorov, AVCai, MPalmer, ESDedek, MMCain, JPVan Scoy, ARTan, BVagner, JTrivedi, DHruby, VJ Structure-activity relationships of cyclic lactam analogues of alpha-melanocyte-stimulating hormone (alpha-MSH) targeting the human melanocortin-3 receptor. J Med Chem51:187-95 (2008) 
 
Melanocortin receptor 5
Name:Melanocortin receptor 5
Type:Enzyme
Mol. Mass.:36612.92
Organism:Homo sapiens (Human)
Description:P33032
Residue:325
BDBM50230826
NameBDBM50230826
Synonyms:CHEMBL253574 | c[CO-o-C6H4-CO-Pro-D-Phe-Arg-Trp-Lys]-NH2
TypeSmall organic molecule
Emp. Form.C45H55N11O7
Mol. Mass.861.9877
SMILESNC(N)=NCCC[C@@H]1NC(=O)[C@@H](Cc2ccccc2)NC(=O)[C@@H]2CCCN2C(=O)c2ccccc2C(=O)NCCCC[C@H](NC(=O)[C@H](Cc2c[nH]c3ccccc23)NC1=O)C(N)=O