Reaction Details
TargetMetabotropic glutamate receptor 1
LigandBDBM50163592
Substrate/Competitorn/a
Meas. Tech.ChEMBL_461179 (CHEMBL945124)
IC50 1.21±n/a nM
Citation Schkeryantz, JMKingston, AEJohnson, MP Prospects for metabotropic glutamate 1 receptor antagonists in the treatment of neuropathic pain. J Med Chem50:2563-8 (2007) 
 
Metabotropic glutamate receptor 1
Name:Metabotropic glutamate receptor 1
Type:Enzyme
Mol. Mass.:132358.19
Organism:Homo sapiens (Human)
Description:Q13255
Residue:1194
BDBM50163592
NameBDBM50163592
Synonyms:(3,4-Dihydro-2H-1-oxa-9-aza-anthracen-6-yl)-(4-methoxy-cyclohexyl)-methanone | CHEMBL174588
TypeSmall organic molecule
Emp. Form.C20H23NO3
Mol. Mass.325.4015
SMILESCO[C@H]1CC[C@H](CC1)C(=O)c1ccc2nc3OCCCc3cc2c1