Reaction Details
TargetAcetylcholinesterase
LigandBDBM50166984
Substrate/Competitorn/a
Meas. Tech.ChEMBL_462117 (CHEMBL945890)
IC50 4.1±n/a nM
Citation Cavalli, ABolognesi, MLMinarini, ARosini, MTumiatti, VRecanatini, MMelchiorre, C Multi-target-directed ligands to combat neurodegenerative diseases. J Med Chem51:347-72 (2008) 
 
Acetylcholinesterase
Name:Acetylcholinesterase
Type:Enzyme
Mol. Mass.:67792.70
Organism:Homo sapiens (Human)
Description:P22303
Residue:614
BDBM50166984
NameBDBM50166984
Synonyms:3-Methyl-2-(4-methyl-piperazin-1-yl)-quinoline-4-carboxylic acid [7-(1,2,3,4-tetrahydro-acridin-9-ylamino)-heptyl]-amide CHEMBL195241
TypeSmall organic molecule
Emp. Form.C36H46N6O
Mol. Mass.578.79
SMILESCN1CCN(CC1)c1nc2ccccc2c(C(=O)NCCCCCCCNc2c3CCCCc3nc3ccccc23)c1C