Reaction Details
TargetC-C chemokine receptor type 5
LigandBDBM50143750
Substrate/Competitorn/a
Meas. Tech.ChEMBL_462625 (CHEMBL929614)
IC50 3.3±n/a nM
Citation Thoma, GBeerli, CBigaud, MBruns, CCooke, NGStreiff, MBZerwes, HG Reduced cardiac side-effect potential by introduction of polar groups: discovery of NIBR-1282, an orally bioavailable CCR5 antagonist which is active in vivo. Bioorg Med Chem Lett18:2000-5 (2008) 
 
C-C chemokine receptor type 5
Name:C-C chemokine receptor type 5
Type:Enzyme
Mol. Mass.:40540.21
Organism:Homo sapiens (Human)
Description:P51681
Residue:352
BDBM50143750
NameBDBM50143750
Synonyms:(2,4-Dimethyl-1-oxy-pyridin-3-yl)-(4-diphenylamino-4'-methyl-[1,4']bipiperidinyl-1'-yl)-methanone | CHEMBL556314
TypeSmall organic molecule
Emp. Form.C31H38N4O2
Mol. Mass.498.659
SMILESCc1cc[n+]([O-])c(C)c1C(=O)N1CCC(C)(CC1)N1CCC(CC1)N(c1ccccc1)c1ccccc1