Reaction Details
TargetC-C chemokine receptor type 5
LigandBDBM50234730
Substrate/Competitorn/a
Meas. Tech.ChEMBL_462625 (CHEMBL929614)
IC50 1.3±n/a nM
Citation Thoma, GBeerli, CBigaud, MBruns, CCooke, NGStreiff, MBZerwes, HG Reduced cardiac side-effect potential by introduction of polar groups: discovery of NIBR-1282, an orally bioavailable CCR5 antagonist which is active in vivo. Bioorg Med Chem Lett18:2000-5 (2008) 
 
C-C chemokine receptor type 5
Name:C-C chemokine receptor type 5
Type:Enzyme
Mol. Mass.:40540.21
Organism:Homo sapiens (Human)
Description:P51681
Residue:352
BDBM50234730
NameBDBM50234730
Synonyms:(4-methyl-4-(4-(phenyl(pyridin-3-yl)amino)piperidin-1-yl)piperidin-1-yl)(naphthalen-1-yl)methanone | CHEMBL401929
TypeSmall organic molecule
Emp. Form.C33H36N4O
Mol. Mass.504.6651
SMILESCC1(CCN(CC1)C(=O)c1cccc2ccccc12)N1CCC(CC1)N(c1ccccc1)c1cccnc1