Reaction Details
TargetC-C chemokine receptor type 5
LigandBDBM50143736
Substrate/Competitorn/a
Meas. Tech.ChEMBL_462626 (CHEMBL929615)
IC50 0.7±n/a nM
Citation Thoma, GBeerli, CBigaud, MBruns, CCooke, NGStreiff, MBZerwes, HG Reduced cardiac side-effect potential by introduction of polar groups: discovery of NIBR-1282, an orally bioavailable CCR5 antagonist which is active in vivo. Bioorg Med Chem Lett18:2000-5 (2008) 
 
C-C chemokine receptor type 5
Name:C-C chemokine receptor type 5
Type:PROTEIN
Mol. Mass.:40522.13
Organism:Macaca fascicularis
Description:ChEMBL_462626
Residue:352
BDBM50143736
NameBDBM50143736
Synonyms:(2,6-Dimethyl-phenyl)-(4-diphenylamino-4'-methyl-[1,4']bipiperidinyl-1'-yl)-methanone CHEMBL62152
TypeSmall organic molecule
Emp. Form.C32H39N3O
Mol. Mass.481.6716
SMILESCc1cccc(C)c1C(=O)N1CCC(C)(CC1)N1CCC(CC1)N(c1ccccc1)c1ccccc1