Reaction Details
TargetC-X-C chemokine receptor type 2
LigandBDBM50236299
Substrate/Competitorn/a
Meas. Tech.ChEMBL_462970 (CHEMBL928888)
IC50 400±n/a nM
Citation Winters, MPCrysler, CSubasinghe, NRyan, DLeong, LZhao, SDonatelli, RYurkow, EMazzulla, MBoczon, LManthey, CLMolloy, CRaymond, HMurray, LMcAlonan, LTomczuk, B Carboxylic acid bioisosteres acylsulfonamides, acylsulfamides, and sulfonylureas as novel antagonists of the CXCR2 receptor. Bioorg Med Chem Lett18:1926-30 (2008) 
 
C-X-C chemokine receptor type 2
Name:C-X-C chemokine receptor type 2
Type:Protein
Mol. Mass.:40767.88
Organism:Homo sapiens (Human)
Description:P25025
Residue:360
BDBM50236299
NameBDBM50236299
Synonyms:1-(2-chlorophenylsulfonyl)-3-(2-(5-cyano-2-(4-fluorophenyl)-1H-indol-3-yl)ethyl)urea | CHEMBL404662
TypeSmall organic molecule
Emp. Form.C24H18ClFN4O3S
Mol. Mass.496.941
SMILESFc1ccc(cc1)-c1[nH]c2ccc(cc2c1CCNC(=O)NS(=O)(=O)c1ccccc1Cl)C#N