Reaction Details
TargetC-X-C chemokine receptor type 2
LigandBDBM50236310
Substrate/Competitorn/a
Meas. Tech.ChEMBL_462970 (CHEMBL928888)
IC50 140±n/a nM
Citation Winters, MPCrysler, CSubasinghe, NRyan, DLeong, LZhao, SDonatelli, RYurkow, EMazzulla, MBoczon, LManthey, CLMolloy, CRaymond, HMurray, LMcAlonan, LTomczuk, B Carboxylic acid bioisosteres acylsulfonamides, acylsulfamides, and sulfonylureas as novel antagonists of the CXCR2 receptor. Bioorg Med Chem Lett18:1926-30 (2008) 
 
C-X-C chemokine receptor type 2
Name:C-X-C chemokine receptor type 2
Type:Protein
Mol. Mass.:40767.88
Organism:Homo sapiens (Human)
Description:P25025
Residue:360
BDBM50236310
NameBDBM50236310
Synonyms:1-(2-(5-cyano-2-(4-fluorophenyl)-1H-indol-3-yl)ethyl)-3-(phenylsulfonyl)urea | CHEMBL254978
TypeSmall organic molecule
Emp. Form.C24H19FN4O3S
Mol. Mass.462.496
SMILESFc1ccc(cc1)-c1[nH]c2ccc(cc2c1CCNC(=O)NS(=O)(=O)c1ccccc1)C#N