Reaction Details
TargetC-X-C chemokine receptor type 2
LigandBDBM50236313
Substrate/Competitorn/a
Meas. Tech.ChEMBL_462970 (CHEMBL928888)
IC50>2000±n/a nM
Citation Winters, MPCrysler, CSubasinghe, NRyan, DLeong, LZhao, SDonatelli, RYurkow, EMazzulla, MBoczon, LManthey, CLMolloy, CRaymond, HMurray, LMcAlonan, LTomczuk, B Carboxylic acid bioisosteres acylsulfonamides, acylsulfamides, and sulfonylureas as novel antagonists of the CXCR2 receptor. Bioorg Med Chem Lett18:1926-30 (2008) 
 
C-X-C chemokine receptor type 2
Name:C-X-C chemokine receptor type 2
Type:Protein
Mol. Mass.:40767.88
Organism:Homo sapiens (Human)
Description:P25025
Residue:360
BDBM50236313
NameBDBM50236313
Synonyms:4-(5-cyano-2-(4-fluorophenyl)-1H-indol-3-yl)-N-methyl-N-(methylsulfonyl)butanamide | CHEMBL258419
TypeSmall organic molecule
Emp. Form.C21H20FN3O3S
Mol. Mass.413.465
SMILESCN(C(=O)CCCc1c([nH]c2ccc(cc12)C#N)-c1ccc(F)cc1)S(C)(=O)=O