Reaction Details
Target5-hydroxytryptamine receptor 5A
LigandBDBM50371459
Substrate/Competitorn/a
Meas. Tech.ChEMBL_463649 (CHEMBL930817)
Ki 6.5±n/a nM
Citation Peters, JULübbers, TAlanine, AKolczewski, SBlasco, FSteward, L Cyclic guanidines as dual 5-HT5A/5-HT7 receptor ligands: structure-activity relationship elucidation. Bioorg Med Chem Lett18:256-61 (2008) 
 
5-hydroxytryptamine receptor 5A
Name:5-hydroxytryptamine receptor 5A
Type:Enzyme
Mol. Mass.:40266.25
Organism:Homo sapiens (Human)
Description:P47898
Residue:357
BDBM50371459
NameBDBM50371459
Synonyms:CHEMBL272781
TypeSmall organic molecule
Emp. Form.C9H9Cl2N3
Mol. Mass.230.094
SMILESCC1NC(N)=Nc2c(Cl)ccc(Cl)c12