Reaction Details
Target5-hydroxytryptamine receptor 7
LigandBDBM50371459
Substrate/Competitorn/a
Meas. Tech.ChEMBL_463656 (CHEMBL930824)
Ki 2.4±n/a nM
Citation Peters, JULübbers, TAlanine, AKolczewski, SBlasco, FSteward, L Cyclic guanidines as dual 5-HT5A/5-HT7 receptor ligands: structure-activity relationship elucidation. Bioorg Med Chem Lett18:256-61 (2008) 
 
5-hydroxytryptamine receptor 7
Name:5-hydroxytryptamine receptor 7
Type:G Protein-Coupled Receptor (GPCR)
Mol. Mass.:53573.08
Organism:Homo sapiens (Human)
Description:P34969
Residue:479
BDBM50371459
NameBDBM50371459
Synonyms:CHEMBL272781
TypeSmall organic molecule
Emp. Form.C9H9Cl2N3
Mol. Mass.230.094
SMILESCC1NC(N)=Nc2c(Cl)ccc(Cl)c12