Reaction Details
TargetC-X-C chemokine receptor type 3
LigandBDBM50371496
Substrate/Competitorn/a
Meas. Tech.ChEMBL_463732 (CHEMBL932090)
IC50 6.4±n/a nM
Citation Du, XChen, XMihalic, JTDeignan, JDuquette, JLi, ARLemon, BMa, JMiao, SEbsworth, KSullivan, TJTonn, GCollins, TLMedina, JC Design and optimization of imidazole derivatives as potent CXCR3 antagonists. Bioorg Med Chem Lett18:608-13 (2008) 
 
C-X-C chemokine receptor type 3
Name:C-X-C chemokine receptor type 3
Type:Enzyme Catalytic Domain
Mol. Mass.:40665.65
Organism:Homo sapiens (Human)
Description:n/a
Residue:368
BDBM50371496
NameBDBM50371496
Synonyms:CHEMBL403378
TypeSmall organic molecule
Emp. Form.C34H36F4N4O2
Mol. Mass.608.6689
SMILESCCOc1ccc(cc1)-n1cc(nc1[C@@H](C)N(C[C@@H]1CCCN1C)C(=O)Cc1ccc(F)c(c1)C(F)(F)F)-c1ccccc1