Reaction Details
TargetC-X-C chemokine receptor type 3
LigandBDBM50229439
Substrate/Competitorn/a
Meas. Tech.ChEMBL_463733 (CHEMBL932091)
IC50 14±n/a nM
Citation Du, XChen, XMihalic, JTDeignan, JDuquette, JLi, ARLemon, BMa, JMiao, SEbsworth, KSullivan, TJTonn, GCollins, TLMedina, JC Design and optimization of imidazole derivatives as potent CXCR3 antagonists. Bioorg Med Chem Lett18:608-13 (2008) 
 
C-X-C chemokine receptor type 3
Name:C-X-C chemokine receptor type 3
Type:Enzyme Catalytic Domain
Mol. Mass.:40665.65
Organism:Homo sapiens (Human)
Description:n/a
Residue:368
BDBM50229439
NameBDBM50229439
Synonyms:(R)-N-(1-(1-(4-cyanophenyl)-4-phenyl-1H-imidazol-2-yl)ethyl)-N-(2-(ethylsulfonyl)ethyl)-2-(4-fluoro-3-(trifluoromethyl)phenyl)acetamide | CHEMBL403036
TypeSmall organic molecule
Emp. Form.C31H28F4N4O3S
Mol. Mass.612.638
SMILESCCS(=O)(=O)CCN([C@H](C)c1nc(cn1-c1ccc(cc1)C#N)-c1ccccc1)C(=O)Cc1ccc(F)c(c1)C(F)(F)F