Reaction Details
TargetCholinesterase
LigandBDBM50233374
Substrate/Competitorn/a
Meas. Tech.ChEMBL_463760 (CHEMBL932017)
IC50 9.9±n/a nM
Citation Fang, LAppenroth, DDecker, MKiehntopf, MRoegler, CDeufel, TFleck, CPeng, SZhang, YLehmann, J Synthesis and biological evaluation of NO-donor-tacrine hybrids as hepatoprotective anti-Alzheimer drug candidates. J Med Chem51:713-6 (2008) 
 
Cholinesterase
Name:Cholinesterase
Type:Homotetramer
Mol. Mass.:68422.27
Organism:Homo sapiens (Human)
Description:P06276
Residue:602
BDBM50233374
NameBDBM50233374
Synonyms:9-[N-gamma-(3'-(nitrooxy)propyl)-gamma-aminobutylamino]-1,2,3,4-tetrahydroacridine N-(3-Nitrooxy-propyl)-N'-(1,2,3,4-tetrahydro-acridin-9-yl)-butane-1,4-diamine
TypeSmall organic molecule
Emp. Form.C20H28N4O3
Mol. Mass.372.4613
SMILES[O-][N+](=O)OCCCNCCCCNc1c2CCCCc2nc2ccccc12