Reaction Details
TargetP2Y purinoceptor 2
LigandBDBM50029031
Substrate/Competitorn/a
Meas. Tech.ChEMBL_463989 (CHEMBL929976)
IC50 1850±n/a nM
Citation Weyler, SBaqi, YHillmann, PKaulich, MHunder, AMMüller, IAMüller, CE Combinatorial synthesis of anilinoanthraquinone derivatives and evaluation as non-nucleotide-derived P2Y2 receptor antagonists. Bioorg Med Chem Lett18:223-7 (2008) 
 
P2Y purinoceptor 2
Name:P2Y purinoceptor 2
Type:PROTEIN
Mol. Mass.:42299.21
Organism:Homo sapiens (Human)
Description:ChEMBL_1455361
Residue:377
BDBM50029031
NameBDBM50029031
Synonyms:1-Amino-4-{4-[4-chloro-6-(3-sulfo-phenylamino)-[1,3,5]triazin-2-ylamino]-3-sulfo-phenylamino}-9,10-dioxo-9,10-dihydro-anthracene-2-sulfonic acid1-Amino-4-{4-[4-chloro-6-(4-sulfo-phenylamino)-[1,3,5]triazin-2-ylamino]-3-sulfo-phenylamino}-9,10-dioxo-9,10-dihydro-anthracene-2-sulfonic acid CID44285648 cibacron blue (mixer, meta and para isomers
TypeSmall organic molecule
Emp. Form.C29H17ClN7O11S3
Mol. Mass.771.135
SMILESNc1c(cc(Nc2ccc(Nc3nc(Cl)nc(Nc4cccc(c4)S([O-])(=O)=O)n3)c(c2)S([O-])(=O)=O)c2C(=O)c3ccccc3C(=O)c12)S([O-])(=O)=O