Reaction Details
TargetP2Y purinoceptor 2
LigandBDBM50227018
Substrate/Competitorn/a
Meas. Tech.ChEMBL_463988 (CHEMBL929975)
IC50>100000±n/a nM
Citation Weyler, SBaqi, YHillmann, PKaulich, MHunder, AMMüller, IAMüller, CE Combinatorial synthesis of anilinoanthraquinone derivatives and evaluation as non-nucleotide-derived P2Y2 receptor antagonists. Bioorg Med Chem Lett18:223-7 (2008) 
 
P2Y purinoceptor 2
Name:P2Y purinoceptor 2
Type:PROTEIN
Mol. Mass.:42202.78
Organism:Mus musculus
Description:ChEMBL_587770
Residue:373
BDBM50227018
NameBDBM50227018
Synonyms:CHEMBL404659 | Sodium 1-amino-4-(3-nitrophenylamino)-9,10-dioxo-9,10-dihydroanthracene-2-sulfonate
TypeSmall organic molecule
Emp. Form.C20H12N3O7S
Mol. Mass.438.391
SMILESNc1c2C(=O)c3ccccc3C(=O)c2c(Nc2cccc(c2)[N+]([O-])=O)cc1S([O-])(=O)=O